{"text_format":"1","workbook":"xlsx","n_sheets":9,"sheets":["Comments","Progress-Status","Categories","Detailed Status","To-Do","Historical Status","CAD","Rogue Comments","Sheet1"],"not_rendered":{"charts":0,"images":0,"macros":0,"external_links":0,"defined_names":4,"comments":1,"pivot_tables":0},"unopened":[],"bounds":{"document_bytes":16777216,"sheet_cells":100000,"rows_first":2000,"rows_last":500,"rows_between":2000,"halvings":0,"cell_chars":16384,"cell_head_chars":4096},"cells_cut":0,"cells_raw":0,"read":"whole","date_system":"1900"}

{"sheet":"Comments","index":0,"n_rows":245,"n_cols":22,"rows_kept":245,"cut":false,"hidden":false,"merged":[]}
["Comment ID","Comment #","Name","Style","Index #","Vote","Affiliation","Category","Page","Sub-clause","Line #","Comment","File","Proposed Change","Must Be Satisfied?","Disposition Status (Accepted, Rejected, Revised)","Disposition Detail","Category","Notes","Editor Status DONE, Ready, N/A)","Editor Notes","Assignee"]
[null,null,"Billy Verso",null,104,"No","Qorvo","Editorial",1,"-",13,"Extraneous \"0.39\" at the end of the line",null,"Delete \"0.39\"","No","Accepted",null,null,null,"DONE"]
[null,null,"Tero Kivinen",null,33,"No","Wi-SUN Alliance","Editorial",1,"Frontmatter",13,"There is extra string \"0.39\" at the end of line. ",null,"Remove extra characters.","No","Accepted",null,null,null,"DONE"]
[null,null,"Tero Kivinen",null,34,"No","Wi-SUN Alliance","Editorial",9,"Introduction",26,"The copyright year in the footer is wrong. ",null,"Change copyright year in the footer to 2025 starting from page 9 to the end of document.","No","Accepted",null,null,null,"DONE"]
[null,null,"Billy Verso",null,105,"No","Qorvo","Editorial",9,"-",27,"Copyright in footer from p9 should be latest year (2025)  ",null,"change to \"2025\"","No","Accepted",null,null,null,"DONE"]
[null,null,"Huan-Bang Li",null,46,"Yes","NICT","General",14,3.2,11,"Add acronym 'HBS' for 'Hyper Block Structure'.",null,"as suggested.","Yes","Rejected","This only appears as HBS IE, and it is not the practice  to put the IE acronyms in clause 3.2",null,null,"N/A"]
[null,null,"Alex Krebs",null,187,"Yes","Apple","Editorial",14,"3.2",11,"To most humans ARDEV vs ERDEV naming is confusing and indistinguishable what is advanced and what is enhanced.",null,"Consider renaming ARDEV to MMSRDEV or X-ERDEV or something else more intuitive to understand that 4ab ARDEV is a feature increment to 4z ERDEV.","No",null,null,null,null,"Assigned",null,"Editor"]
[null,null,"Tero Kivinen",null,37,"No","Wi-SUN Alliance","Editorial",14,3.2,17,"Acronym list is not sorted alphabetically. ",null,"Move RSR to correct place by sorting the acronym list.","No","Accepted",null,null,null,"DONE"]
[null,null,"Tero Kivinen",null,35,"No","Wi-SUN Alliance","Editorial",14,3.2,24,"The acronym SBP has expansion of \"UWB sensing by proxy\", but U is not present in the acronym, and is not used when SBP is expanded. ",null,"Change \"UWB sensing by proxy\" to \"sensing by proxy\".","No","Revised","Change \"UWB\" to \"(UWB)\"",null,null,"DONE","Email Tero to explain"]
[null,null,"Tero Kivinen",null,36,"No","Wi-SUN Alliance","Editorial",14,3.2,25,"The acronym SDEV has expansion of \"UWB sensing device\", but U is not present in the acronym, and is not used when SDEV is expanded. ",null,"Change \"UWB sensing device\" to \"sensing device\".","No","Revised","Change \"UWB\" to \"(UWB)\"",null,null,"DONE","Email Tero to explain"]
[null,null,"Pooria Pakrooh",null,174,"No","Qualcomm","Technical",16,"6.6.3.3",18,"The text change from D02 to D03 is modifying the normative language. The sentence in D02 was more clearly reflecting the mandatory/optional values for AIFS for EMDEV. ",null,"Use the sentence in D02, as it better represents the normative language.\"For the high-rate pulse repetition frequency UWB PHY based enhanced modulations device (HRP-EMDEV) sending Imm-Ack, the AIFS duration shall be equal to the value of the macEmdevImmAckAifsPeriod attribute in Table 8-36.\"","Yes",null,null,null,null,null,"ACK"]
[null,null,"Pooria Pakrooh",null,175,"No","Qualcomm","Technical",23,"8.3.2.3",1,"The Rmarkers are defined as 32-bit parameters (similar to 15.4z). That is a maximum of ~67 ms. However, I don't think this is enough for non-interleaved MMS. Treply and Tround for compact frames are defined as 40-bit parameters though, which should be good. Seems like 32-bit has not been updated after adding the non-interleaved mode.",null,"In Table 8-28: \n\n1. Change the valid range to make the elements of RangingReportDescriptor array 10 bit long.\n2. Also, specify that each of 8 elements of the array has thios valid range.","Yes","Revised","Doc 15-25-0522-01-04ab-lb225-d03-comment-resolution-cid-175.docx",null,null,"DONE"]
[null,null,"Billy Verso",null,106,"No","Qorvo","Technical",23,"8.3.3",7,"The range actually depends on the PHY, and the valid range for each PHY given below the table.  I think rather than changing to say 0-8 , a better change  would be to say it depends on the PHY, as per the proposed change (right), especially as arguably a value of 8 which was added to select O-QPSK configuration, is not correct anyway see my comments on p24 line 3. ",null,"Instead of replacing \"0–7\" by \"0–8\" replace it by \"PHY dependent, as described below the table\"","Yes",null,null,null,null,"Assigned","O-QPSK-Modulation/Rate","Huan-Bang"]
[null,null,"Alex Krebs",null,188,"Yes","Apple","Technical",23,"8.3.2.3 RangingReportDescriptor","2 (Table 8-28)","This table only describes up to 8 RIF markers, but misses up to 16 RSF markers.",null,"Duplicate the 4 rows of this table and rename \"Rif\" to \"Rsf\", \"RIF\" to \"RSF\", and change \"Array of eight\" to \"Array of sixteen\" in the resulting 4 additional rows.","No",null,"Doc 15-25-0551-00-04ab-Resolution-of-LB225-comment-index-188.docx",null,null,"Assigned",null,"Billy"]
[null,null,"Mickael Maman",null,73,"Yes","STMicroelectronics","Technical",24,"8.3.3",1,"Add MmsFixedReplyTimeEnable in TxOptions for MMS with fixed reply time option",null,"add new element of TxOptions in Table 8-29\"MmsFixedReplyTimeEnable|Boolean|TRUE, FALSE|For MMS UWB ranging, this parameter is set TRUE if the transmission of the MMS UWB packet is offset from the reception of the MMS UWB packet, or FALSE otherwise","Yes",null,null,null,null,"Assigned","Fixed Reply Time","Mickael"]
[null,null,"Billy Verso",null,107,"No","Qorvo","Technical",24,"8.3.3",3,"There is a conflict between phyOqpskModulationConfig setting the modulation (p214 line 21) and the O-QPSK modulation and the DataRate parameter to the MCPS-DATA.request also doing it for the O-QPSK PHY (p24 line 2).  Could remove the use of DataRate, or make phyOqpskModulationConfig only specify the RX modulation. However this needs careful consideration to make sure the solution covers all the cases and various operations, and that we set all modes appropriately in TX and RX especially so that the receiver can correctly receive and decode the packet and report the result.",null,"The solution proposed for my other comment on this same line seems to be a good way to do it….","Yes",null,null,null,null,"Assigned","O-QPSK-Modulation/Rate","Huan-Bang"]
[null,null,"Billy Verso",null,108,"No","Qorvo","Technical",24,"8.3.3",3,"There is something wrong here, configuration #8 in Table 69 is a \"varies\" mode, so for the O-QPSK PHY DataRate parameter value of 8 does not tell the transmitter what modulation to use. Also DataRate values #2 to #5 in the \"varies\" case have to send a different SFD, versus same values when not in the varies case. (Note DataRate is also reported in MCSP-DATA-indication referencing these TX options for the meaning, in that case also the value #8 would be meaningless as a receive rate).",null,"A solution to this and the other comment I have relating to the conflict with phyOqpskModulationConfig would be to have this DataRate parameter only used when phyOqpskModulationConfig=8 and in that case have DataRate values #1 to #5 only as valid and selecting both the datarate and the SFD pattern.   When phyOqpskModulationConfig is not 8 the DataRate parameter would be meaningless/ignored and the TX and RX mode are selected by phyOqpskModulationConfig only.","Yes",null,null,null,null,"Assigned","O-QPSK-Modulation/Rate","Huan-Bang"]
[null,null,"Mickael Maman",null,74,"Yes","STMicroelectronics","Technical",26,"8.3.4",4,"add description of MmsFixedReplyTimeEnable for MMS with fixed reply time option",null,"add \"The MmsFixedReplyTimeEnable parameter of TxOptions applies to UWB multi-millisecond (MMS) packet transmissions. When MmsFixedReplyTimeEnable is the transmission of MMS UWB packet is offset by a fixed reply time from the reception of the initiator's MMS UWB packet. By default, MmsFixedReplyTimeEnable is FALSE. The fixed reply time may be a fixed known quantity, agreed between the parties participating in the ranging exchange.\"","Yes",null,null,null,null,"Assigned","Fixed Reply Time","Mickael"]
[null,null,"Tero Kivinen",null,38,"No","Wi-SUN Alliance","Editorial",26,"8.3.4",6,"The Description field of the CompactFrameID has some invalid font for the last sentence. ",null,"Fix the font.","No","Accepted",null,null,null,"DONE"]
[null,null,"Huan-Bang Li",null,47,"Yes","NICT","Editorial",26,"8.3.4",6,"In the description of 'CompactFrameID' in the first row of Table 1, the second sentence starting with \"If CompactSecurityEnabled …\" uses different font style compared to the rest of the text.",null,"unify font style to the others.","Yes","Accepted",null,null,null,"DONE"]
{"$rows_left_out":226}
{"sheet":"Progress-Status","index":1,"n_rows":497,"n_cols":29,"rows_kept":497,"cut":false,"hidden":false,"merged":[[26,1,26,24],[34,1,34,24],[1,1,1,8],[1,10,1,18],[6,4,6,6],[10,10,10,16],[18,1,18,24]]}
[]
[null,"Comments and Resolution Status",null,null,null,null,null,null,null,null,"Draft Editing Status"]
[]
[null,"Total #  Comments","# with Blank resolution","# with non-blank resolution","# with \"Rejected\" resolution","# with \"Accepted\" resolution","# with \"Revised\" resolution","# Assigned","No Resolution, not Assigned",null,"DONE","N/A",null,"PART","Ready","ISSUE","ASSIGNED",null,"Blanks"]
[null,{"$f":"COUNTA(Comments!E:E)-1","v":244},{"$f":"B5-D5","v":155},{"$f":"COUNTA(Comments!P:P)-1","v":89},{"$f":"COUNTIF(Comments!P:P,\"Rejected\")","v":7},{"$f":"COUNTIF(Comments!P:P,\"Accepted\")","v":68},{"$f":"COUNTIF(Comments!P:P,\"Revised\")","v":14},{"$f":"COUNTA(Comments!V:V)-1","v":140},{"$f":"B5-D5-H5","v":15},null,{"$f":"COUNTIF(Comments!T:T,K4)","v":82},{"$f":"COUNTIF(Comments!T:T,L4)","v":7},null,{"$f":"COUNTIF(Comments!T:T,N4)","v":0},{"$f":"COUNTIF(Comments!T:T,O4)","v":0},{"$f":"COUNTIF(Comments!T:T,P4)","v":0},{"$f":"COUNTIF(Comments!T:T,Q4)","v":140},null,{"$f":"B5-(COUNTA(Comments!T:T)-1)","v":15}]
[]
[null,"Technical","Editorial",{"$f":"IF(D5=E7,\"Okay\",\"MIS-MATCHED\")","v":"Okay"},{"$f":"E5+F5+G5","v":89},null,null,null,null,null,{"$f":"SUM(K5:L5)","v":89},"Done + N/A"]
[null,{"$f":"COUNTIF(Comments!H:H,B7)","v":164},{"$f":"COUNTIF(Comments!H:H,C7)","v":77}]
[null,"General",{"$f":"IF(B5=C10,\"Okay\",\"MIS-MATCHED\")","v":"Okay"},{"$f":"D5/$B5","v":0.36475409836065575},2.8688524590163935E-2,0.27868852459016391,5.737704918032787E-2,0.57377049180327866,6.1475409836065573E-2,null,{"$f":"K7/$B$5","v":0.36475409836065575},"of total",null,{"$f":"N5/$B$5","v":0},{"$f":"O5/$B$5","v":0},{"$f":"P5/$B$5","v":0},{"$f":"Q5/$B$5","v":0.57377049180327866},null,{"$f":"S5/$B$5","v":6.1475409836065573E-2}]
[null,{"$f":"COUNTIF(Comments!H:H,B9)","v":3},{"$f":"C8+B8+B10","v":244}]
[null,null,null,null,null,null,null,null,null,null,{"$f":"K9+SUM(N9:Q9)","v":0.93852459016393441}]
[]
[]
[]
[]
[null,null,null,null,null,null,null,null,null,null,null," "]
[]
[]
[null,"Assigned Comments"]
[]
{"$rows_left_out":478}
{"sheet":"Categories","index":2,"n_rows":497,"n_cols":23,"rows_kept":497,"cut":false,"hidden":false,"merged":[]}
["MMS w/NBA","MMS wo/NBA","New frame format","Ack changes","RSS","SSBD","Other channel access","Security","Multi-node ranging / Hyper Block","Narrow Band function","Device discovery Ranging","Device discovery Data","Parameter Negotiation","Wake-up Radio","UWB data offload","Narrow Band PHY","UWB PHY HRP","UWB PHY LE","Sensing","Dynamic Data Rate Mode","PICS","IEs","OTHER"]
["NBMSS","UWBMSS","NEWFR","ACK","RSS","SSBD","CHA","SEC","HB","NBF","DISC-R","DISC-D","PARNEG","WUR","UWBDO","PHYNB","PHYHRP","PHYLE","SENS","DDRN","PICS",null,"OTHER"]
["Alex","Carl","Alex","Billy","Sven","Larry","Ben","Rojan","Youngwan","Alex","Alex","[Carlos]","Billy","Billy","Youngwan","Bin Q","Vinod","Larry","Pooria & Bin Q","[Carlos]"]
[]
[]
[]
[null,null,null,null,null,"11.2.8"]
[null,null,null,null,null,"12.3.2"]
[]
[]
[]
[]
[]
[]
[]
[]
[]
[]
[]
[]
{"$rows_left_out":478}
{"sheet":"Detailed Status","index":3,"n_rows":4,"n_cols":21,"rows_kept":4,"cut":false,"hidden":false,"merged":[[2,10,2,19],[3,10,3,19],[0,1,0,3],[0,4,0,5],[0,6,0,8],[0,9,0,20],[1,1,1,3],[1,4,1,5],[1,6,1,8],[1,9,1,20]]}
["Resolution","Accepted",null,null,"Rejected",null,"Revised",null,null,"Blank"]
[null,{"$f":"COUNTIF(Comments!P:P,\"Accepted\")","v":68},null,null,{"$f":"COUNTIF(Comments!P:P,\"Rejected\")","v":7},null,{"$f":"COUNTIF(Comments!P:P,\"Revised\")","v":14},null,null,0]
["Editor Status","ISSUE","Ready","DONE","Waiting","N/A","ISSUE","Ready","DONE","Ready","Assigned",null,null,null,null,null,null,null,null,null,"Unassigned"]
[null,0,0,0,0,0,0,0,0,0,0,null,null,null,null,null,null,null,null,null,0]

{"sheet":"To-Do","index":4,"n_rows":0,"n_cols":0,"rows_kept":0,"cut":false,"hidden":false,"merged":[]}

{"sheet":"Historical Status","index":5,"n_rows":40,"n_cols":45,"rows_kept":40,"cut":false,"hidden":false,"merged":[[4,0,17,0],[4,1,5,1],[6,1,7,1],[8,1,9,1],[10,1,11,1],[12,1,13,1],[14,1,15,1],[16,1,17,1],[36,1,37,1],[18,0,38,0],[18,1,19,1],[20,1,21,1],[22,1,23,1],[24,1,25,1],[26,1,27,1],[28,1,29,1],[30,1,31,1],[32,1,33,1],[34,1,35,1]]}
["Version",null,"-00","-01","-02","-03","-04","-05","-06","-07","-08","-09","-10","-11","-12","-13","-14","-15","-16","-17","-18","-19","-20","-21","-22","-23","-24","-25","-26","-27","-28","-29","-30","-31","-32","-33","-34","-35","-36","-37","-38","-39","-40","-41","-42"]
["Date",null,"2025-10-06","2025-10-07","2025-10-09","2025-10-09","2025-10-13","2025-10-14"]
["Occasion",null,"Initial spreadsheet",null,"Before 2025-10-09 Telecon","After 2025-10-09 Telecn","Before 2025-10-14 Telecon","After 2025-10-14 Telecon"]
[]
["Editorial","Total",76,81,81,77,77,77]
[null,null,{"$f":"C5/(C5+C19)","v":0.30158730158730157},0.33196721311475408,0.33196721311475408,0.3155737704918033,0.3155737704918033,0.3155737704918033]
[null,"Addressed",0,0,70,70,74,74]
[null,null,{"$f":"C7/C5","v":0},0,0.86419753086419748,0.90909090909090906,0.96103896103896103,0.96103896103896103]
[null,"Ready",0,0,0,0,0,0]
[null,null,{"$f":"C9/C5","v":0},0,0,0,0,0]
[null,"Done",0,0,67,67,71,71]
[null,null,{"$f":"C11/C5","v":0},0,0.8271604938271605,0.87012987012987009,0.92207792207792205,0.92207792207792205]
[null,"N/A",0,0,3,3,3,3]
[null,null,{"$f":"C13/C5","v":0},0,3.7037037037037035E-2,3.896103896103896E-2,3.896103896103896E-2,3.896103896103896E-2]
[null,"ISSUE",0,0,4,0,0,0]
[null,null,{"$f":"C15/C5","v":0},0,4.9382716049382713E-2,0,0,0]
[null,"To Be Addressed",76,81,7,7,3,3]
[null,null,{"$f":"C17/C5","v":1},1,8.6419753086419748E-2,9.0909090909090912E-2,3.896103896103896E-2,3.896103896103896E-2]
["Technical/General","Total",176,163,163,167,167,167]
[null,null,{"$f":"C19/(C19+C5)","v":0.69841269841269837},0.66803278688524592,0.66803278688524592,0.68442622950819676,0.68442622950819676,0.68442622950819676]
{"$rows_left_out":21}
{"sheet":"CAD","index":6,"n_rows":1,"n_cols":22,"rows_kept":1,"cut":false,"hidden":false,"merged":[]}
["Comment ID","Comment #","Name","Style","Index #","Vote","Affiliation","Category","Page","Sub-clause","Line #","Comment","File","Proposed Change","Must Be Satisfied?","Disposition Status (Accepted, Rejected, Revised)","Disposition Detail","Category","Notes","Editor Status DONE, Ready, N/A)","Editor Notes","Assignee"]

{"sheet":"Rogue Comments","index":7,"n_rows":14,"n_cols":22,"rows_kept":14,"cut":false,"hidden":false,"merged":[]}
["Comment ID","Comment #","Name","Style","Index #","Vote","Affiliation","Category","Page","Sub-clause","Line #","Comment","File","Proposed Change","Must Be Satisfied?","Disposition Status (Accepted, Rejected, Revised)","Disposition Detail","Category","Notes","Editor Status DONE, Ready, N/A)","Editor Notes","Assignee"]
[null,null,"Pelen Salem",null,1,"Non-voter","Cisco Systems","Technical",71,"10.39.3.6 ",36,"Regarding the sentence \"Contention-based initialization and setup may be used for one-to-one ranging or one-to-many ranging.\": Instead of \"may\", Contention based protocol (such as LBT) shall be mandatory.",null,"The sentence to be modified to state that Contention based protocol (such as LBT) shall be mandatory.","No"]
[null,null,"Pelen Salem",null,2,"Non-voter","Cisco Systems","Technical",80,"10.39.4.2",32,"There is no standard coexistence mechanism defined for NB channel access when using O-QPSK.",null,"The first sentence to be modified to state that O-QPSK PHY shall use the listen-before-talk (LBT).","No"]
[null,null,"Pelen Salem",null,3,"Non-voter","Cisco Systems","Technical",80,"10.39.4.2",33,"There is no detail of the coexistence mechanism.",null,"LBT scheme details to be inserted including the ED threshold.","No"]
[null,null,"Pelen Salem",null,4,"Non-voter","Cisco Systems","Technical",87,"10.39.8.3 ",18,"CCA is marked as an optional feature, meaning we cannot does not guarantee coexistence with other devices. Additionally, CCA helps prevent transmissions that would cause interference.",null,"A sentence to be inserted to explain that prior to any O-QPSK PHY transmission, CCA mode 1 or 3a must be used. The ED threshold should be set at -75 dBm/MHz or lower. Transmission must not proceed if the CCA indicates the medium is busy.\"","No"]
[null,null,"Pelen Salem",null,5,"Non-voter","Cisco Systems","Technical",87,"10.39.8.3 ",18,"A CCA busy indication before an NB transmission can result in a significant penalty, as it may cause the entire exchange to be lost. Permitting multiple CCA attempts before an NB transmission can enhance the protocol’s resilience to CCA busy conditions.",null,"A paragraph to be inserted to explain that if a CCA indicates a busy medium and the number of consecutive CCAs is less than the value of macMmsNbMaxConsecutiveCCAs, another CCA may be performed after waiting at least 50 microseconds on a different channel or at least 100 microseconds on the same channel.\n\nA receiving device should check for the presence of an expected O-QPSK PHY transmission. If the expected transmission is not detected and the number of consecutive absences is less than macMmsNbMaxConsecutiveCCAs, the device may proceed to the next channel (which may be the same channel) and check for the expected transmission there.\n\nAdd a new MIB variable with the following properties:\n\t•\tAttribute: macMmsNbMaxConsecutiveCCAs\n\t•\tType: Integer\n\t•\tRange: 0–255\n\t•\tDescription: Number of consecutive CCAs\n\t•\tDefault: 2","No"]
[null,null,"Pelen Salem",null,6,"Non-voter","Cisco Systems","Technical",87,"10.39.8.3 ",18,"ED Threshold is not defined.",null,"A sentence to be inserted to define an ED threshold that is set at -75 dBm/MHz or lower.","No"]
[null,null,"Pelen Salem",null,7,"Non-voter","Cisco Systems","Technical",87,"10.39.8.3 ",18,"Regarding \"with CCA mode 1 or 3\": While CCA mode 1 or 3 can be used, it should be noted that CCA mode 3 includes two options: 3a and 3b and only the  option 3a guarantees energy detection.",null,"The sentence needs to be updated to edit \"3\" as \"3a\".","No"]
[null,null,"Pelen Salem",null,8,"Non-voter","Cisco Systems","Technical",87,"10.39.8.3 ",18,"CCA is marked as an optional feature, which falls below industry best practice for three main reasons: 1) .15.4ab devices collide over the air with other .15.4ab devices much more often, thereby prematurely limiting the achievable capacity and QoS/determinism. This directly limits the available use cases and market size for .15.4ab products. 2) Implementers incorporating .15.4ab devices that are built into larger multi-radio devices in a straightforward way collide \"internally\" with the other radios much more often,  so actual integration is more (unnecessarily) challenging, and oftentimes there is no good solution such that performance of the .15.4a device (or the other radios) is compromised (here, energy detect with deferral-in-time is generally recognized as the best option for in-device coexistence). 3) .15.4ab devices collide over the air with other non-.15.4ab devices much more often, thereby prematurely limiting the achievable capacity and QoS/determinism for both systems, and thereby undermining this amazing experiment of unlicensed spectrum and taking us down a path of tragedy of the commons (e.g., in many scenarios 2.4 GHz is regarded as a junk band unsuited to QoS/deterministic traffic because of impolite transmitters) - basically a lack of community-mindedness. \nNote that there is no 4th bullet related to regulations, because regulations are just separate - devices must meet regulations as well as standard-mandated coexistence requirements. Regulations only matter to standards in that standards should provide a toolkit (potentially of optional features) that enables regulatory requirements to be met. Rather, the argument for mandatory coexistence mechanisms rests on the self-interested bullets 1)-3) above.",null,"Mandate CCA based on energy detect at minimum. \nYes CCA (and thence LBT and related technologies) is always based on imperfect information and achieves less than some theoretical optimum, but if we make perfect the enemy of the good or get distracted by regulatory arguments, we don't make any progress towards the three self-interested industry goals identified in the comment.","No"]
[null,null,"Menzo Wentink",null,9,"Non-voter","Qualcomm","Technical",87,"10.39.8.3 ",18,"CCA is optional, which implies that coexistence with other devices can not be ensured. CCA also avoids transmitting into destructive interference.",null,"Insert the following sentence: \"CCA mode 1 or 3a shall be applied immediately before any O-QPSK PHY transmission. The ED threshold shall be -75 dBm/MHz or lower. The transmission shall not occur when the CCA reports a busy medium.\"","No"]
[null,null,"Menzo Wentink",null,10,"Non-voter","Qualcomm","Technical",87,"10.39.8.3 ",18,"CCA busy before an NB transmission causes a high penalty because the entire exchange may be lost. Allow more than one CCA before an NB transmission to incresae the resilience of the protocol against CCA busy.",null,"Insert the following sentences: \"If the CCA reports a busy medium and the number of consecutive CCAs is not equal to macMmsNbMaxConsecutiveCCAs, a new CCA may be performed after at least 50 s on another channel or after at least 100 s on the same channel.\n\nA receiving device shall check for the presence of an expected O-QPSK PHY transmission. If the expected transmission is not present and the number of consecutive absences is not equal to macMmsNbMaxConsecutiveCCAs, the device may go to the next channel (which might be the same channel) and check for the presence of the expected transmission on that channel.\"\n\nInsert a new MIB variable with Attribute \"macMmsNbMaxConsecutiveCCAs\", Type \"Integer\", Range \"0-255\", Description \"Number of consecutive CCAs\", and Default \"2\".","No"]
[null,null,"Menzo Wentink",null,11,"Non-voter","Qualcomm","Technical",87,"10.39.8.3 ",18,"No ED Threshold is defined.",null,"Add \"The ED threshold shall be -75 dBm/MHz or lower.\"","No"]
[null,null,"Menzo Wentink",null,12,"Non-voter","Qualcomm","Technical",87,"10.39.8.3 ",18,"\"with CCA mode 1 or 3\" -- CCA mode 3 has two options, 3a and 3b, but only option 3a will ensure energy detect.",null,"Change \"3\" to \"3a\".","No"]
[null,null,"Pelen Salem",null,13,"Non-voter","Cisco Systems","Technical",203,"10.44.2",12,"How is NB channel access done here?",null,"A sentence or section to be inserted to define a mandatory channel access mechanism consistent with previous sections.","No"]

{"sheet":"Sheet1","index":8,"n_rows":25,"n_cols":3,"rows_kept":25,"cut":false,"hidden":false,"merged":[]}
["Commenter","# Comments"]
["Billy Verso",345,{"$f":"B2/663","v":0.52036199095022628}]
["Mickael Maman",80,0.12066365007541478]
["Tero Kivinen",65,9.8039215686274508E-2]
["Pooria Pakrooh",27,4.072398190045249E-2]
["Rojan Chitrakar",24,3.6199095022624438E-2]
["Huan-Bang Li",21,3.1674208144796379E-2]
["Carlos Aldana",15,2.2624434389140271E-2]
["B. Rolfe",13,1.9607843137254902E-2]
["Li Panpan",12,1.8099547511312219E-2]
["Li-Hsiang Sun",10,1.5082956259426848E-2]
["Bin Tian",10,1.5082956259426848E-2]
["Alex Krebs",9,1.3574660633484163E-2]
["Bin Qian",7,1.0558069381598794E-2]
["Riku Pirhonen",5,7.5414781297134239E-3]
["Larry Zakaib",5,7.5414781297134239E-3]
["Jaegook Lee",3,4.5248868778280547E-3]
["Stephen Shellhammer",2,3.0165912518853697E-3]
["Vinod Kristem",2,3.0165912518853697E-3]
["Dries Neirynck",2,3.0165912518853697E-3]
{"$rows_left_out":5}