{"text_format":"1","workbook":"xlsx","n_sheets":8,"sheets":["Comments","Progress-Status","Categories","Detailed Status","To-Do","Historical Status","CAD","Sheet1"],"not_rendered":{"charts":0,"images":0,"macros":0,"external_links":0,"defined_names":3,"comments":1,"pivot_tables":0},"unopened":[],"bounds":{"document_bytes":16777216,"sheet_cells":100000,"rows_first":2000,"rows_last":500,"rows_between":2000,"halvings":0,"cell_chars":16384,"cell_head_chars":4096},"cells_cut":0,"cells_raw":0,"read":"whole","date_system":"1900"}

{"sheet":"Comments","index":0,"n_rows":664,"n_cols":22,"rows_kept":664,"cut":false,"hidden":false,"merged":[]}
["Comment ID","Comment #","Name","Style","Index #","Vote","Affiliation","Category","Page","Sub-clause","Line #","Comment","File","Proposed Change","Must Be Satisfied?","Disposition Status (Accepted, Rejected, Revised)","Disposition Detail","Category","Notes","Editor Status DONE, Ready, N/A)","Editor Notes","Assignee"]
[null,null,"Kivinen, Tero",null,42,"No","Wi-SUN Alliance","Editorial",1,"Frontmatter",16,"Update copyright year. ",null,"Change 2024 to 2025.","No",null,null,null,null,"Assigned",null,"Editor"]
[null,null,"VERSO, BILLY",null,314,"No","Qorvo","Editorial",3,"Abstract",2,"Strange space at end of line",null,"remove it","No",null,null,null,null,"Assigned",null,"Editor"]
[null,null,"ZAKAIB, LARRY",null,659,"Yes","Spark Microsystems","Editorial",3,"Abstract",11,"Replace \"allowing at least\" with \"extending beyond\"",null,"replace \"allowing at least\" with \"extending beyond\"","Yes",null,null,null,null,"Assigned",null,"Editor"]
[null,null,"ZAKAIB, LARRY",null,660,"Yes","Spark Microsystems","Editorial",3,"Keywords",19,"Add low energy UWB PHY, LE UWB PHY",null,"add low energy UWB PHY, LE UWB PHY","Yes",null,null,null,null,"Assigned",null,"Editor"]
[null,null,"Kivinen, Tero",null,43,"No","Wi-SUN Alliance","Editorial",3,"Frontmatter",23,"Update copyright year. ",null,"Change 2024 to 2025.","No",null,null,null,null,"Assigned",null,"Editor"]
[null,null,"Kivinen, Tero",null,44,"No","Wi-SUN Alliance","Editorial",8,"Frontmatter",4,"Add Vice-chairs, and other WG officials. ",null,"Add Vice chairs (Phil Beecher, Ann Krieger), Working Group Technical Editor (Tero Kivinen), Secretary (Joerg Robert). ","No",null,null,null,null,"Assigned",null,"Editor"]
[null,null,"Kivinen, Tero",null,45,"No","Wi-SUN Alliance","Editorial",8,"Frontmatter",5,"Add task group officials. ",null,"Add TG chair, vice-chair, secretary, technical editor.","No",null,null,null,null,"Assigned",null,"Editor"]
[null,null,"VERSO, BILLY",null,315,"No","Qorvo","Editorial",9,"Introduction",25,"Blank numbered line",null,"delete it","No",null,null,null,null,"Assigned",null,"Editor"]
[null,null,"Kivinen, Tero",null,46,"No","Wi-SUN Alliance","Technical",13,"2",14,"I do not think we need IETF RFC 1951 DEFLATE as normative reference. ",null,"Move this to bibliography.","No","Rejected","Doc 15-25-0175-04-04ab-lb213-easy-comments-lhf.docx",null,null,"N/A"]
[null,null,"Kivinen, Tero",null,47,"No","Wi-SUN Alliance","Editorial",14,3.2,10,"The CSPRNG acronym is not used in the draft. ",null,"Remove CSPRNG from acronym list.","No",null,null,null,null,"Assigned",null,"Editor"]
[null,null,"MAMAN, MICKAEL",null,145,"Yes","STMicroelectronics","Editorial",14,3.2,14,"HRP-SDEV is high-rate pulse repetition frequency UWB PHY based sensing device",null,"remove the second \"UWB\"","Yes",null,null,null,null,"Assigned",null,"Editor"]
[null,null,"Kivinen, Tero",null,48,"No","Wi-SUN Alliance","Editorial",14,3.2,19,"We are avoiding NHL because of trademarks or similar, are there possibility that we end up similar problems with NBA? ",null,"Consider using some other acronym.","No",null,null,null,null,"Assigned",null,"Editor"]
[null,null,"Kivinen, Tero",null,49,"No","Wi-SUN Alliance","Editorial",14,"3.2",20,"OWR is already defined in the base standard, remove from here. ",null,"Remove OWR from the list.","No",null,null,null,null,"Assigned",null,"Editor"]
[null,null,"VERSO, BILLY",null,316,"No","Qorvo","Editorial",15,3.2,1,"the \"sensing\" in the definition should be \"UWB sensing\"",null,"change \"sensing\" to \"UWB sensing\"","No",null,null,null,null,"Assigned",null,"Editor"]
[null,null,"VERSO, BILLY",null,317,"No","Qorvo","General",15,"5.2.5",9,"Is RSS a special application space on its own? I think not, it is more a subset of ranging/RTLS.  If we had someone to draft it, I can think of some broader special application spaces that might be worth adding here, (e.g., real time location, access control, sensing).  In the absence of that I propose to delete all of 5.2.5.",null,"Delete all of 5.2.5","Yes",null,null,null,null,"Suggested Assignment","Ben?  or seek volunteers to do "]
[null,null,"VERSO, BILLY",null,318,"No","Qorvo","Editorial",15,"5.2.5",11,"The word \"mobile\" would be a better choice here vs \"portable\" since we may be locating thing not being carried.",null,"Change \"portable\" to \"mobile\"","No",null,null,null,null,"Assigned",null,"Editor"]
[null,null,"VERSO, BILLY",null,319,"No","Qorvo","Technical",15,"5.2.5",13,"\"Time structures for communication are defined by the upper layer using the UWB ranging service.\" is not clear in meaning anything.",null,"Delete the sentence.","Yes",null,null,null,null,"Suggested Assignment","Ben?  or seek volunteers to do "]
[null,null,"Kivinen, Tero",null,50,"No","Wi-SUN Alliance","Editorial",16,"6.6.1",5,"This is first use of RPA, expand here. ",null,"Expand RPA here.","No",null,null,null,null,"Assigned",null,"Editor"]
[null,null,"Kivinen, Tero",null,51,"No","Wi-SUN Alliance","Technical",16,"6.6.1",5,"The text included is not enough to cover the transmission of the compact frames. For example when source addresses are not present the sender is assumed to be coordinator, and when the destination address is not present then destination shall be either coordinator or broadcast. ",null,"Remove changes from section 6.6.1, move the more complete text of how to transmit compact frames in the 10.xx. ","Yes",null,null,null,null,"Assigned",null,"Alex"]
[null,null,"Kivinen, Tero",null,52,"No","Wi-SUN Alliance","Technical",16,"6.6.2",9,"The text included is not enough to cover the recipient filters of the compact frames. For example there is no frame version number that can be checked, and as the destination address is not present the step 3 might trigger depending on the macImplictBroadcast value. ",null,"Remove changes from section 6.6.2, move the more complete text of how to receive compact frames in the 10.xx. ","Yes",null,null,null,null,"Assigned",null,"Alex"]
[null,null,"VERSO, BILLY",null,320,"No","Qorvo","Technical",16,"6.6.2",9,"\"The RPA is marked as resolved\", is not clear, I think it should refer to the place where the RPA resolution process is described, with reference to IRK etc.",null,"Change to \"… the RPA fields are resolved according to the process described in 10.39.11.1.2.1\" (which is the private addresses clause, which itself should be reviewed to see if it specifies the RPA resolution process sufficiently well, unambiguously, etc.).","Yes",null,null,null,null,"Assigned",null,"Alex"]
[null,null,"PANPAN, LI",null,254,"Non-Voter","Huawei","Technical",16,"6.6.3.4",18,"This paragraph mentioned three times about the AIFS value being xxx, but we see both \"is\" and \"shall be\" and \"equal to\". Should keep consistent, say \"The value of AIFS shall be xxx\" or \"The value of AIFS is equal to xxx\" or something suitable. ",null,"As in comment","Yes",null,null,null,null,"Assigned",null,"Ben"]
[null,null,"PANPAN, LI",null,255,"Non-Voter","Huawei","Technical",16,"6.6.3.4",18,"Too long sentence.",null,"Separate with period before \"otherwise\".","Yes",null,null,null,null,"Assigned",null,"Ben"]
[null,null,"Kivinen, Tero",null,53,"No","Wi-SUN Alliance","Technical",16,"6.6.3.4",25,"This text does not belong here, move it to 10.45.2 where the SSBD algorithm is described. Techincal",null,"Move text to 10.45.2 as it does not belong here. The text in 10.45.2 can say that isRetrnamissionAttempt shall be set to TRUE if packet is retransmission as descibed in 6.6.3.4 and macSsbdPersistence is enabled.","Yes",null,null,null,null,"Assigned",null,"Larry"]
[null,null,"PANPAN, LI",null,256,"Non-Voter","Huawei","Technical",16,"6.6.3.4",25,"Three \"when\"s seem redundant",null,"Change it to \"When the SSBD channel access method, described in 10.45, is used, macSsbdPersistence is enabled, and the packet is a retrasmission, …..\"","Yes",null,null,null,null,"Assigned","I think make Tech and assign to Larry, so I don't mess it up.  I think, it could be a simpler set isRetransmissionAttempt TRUE for all retransmisssions (false otherwise).","Larry"]
[null,null,"VERSO, BILLY",null,321,"No","Qorvo","Technical",16,"6.6.3.4",25,"The paragraph is a single sentence which reads poorly.  Maybe it would be enough to have the simpler sentence, as per the proposed change. ",null,"Replace the paragraph with: \"When the packet is a retransmission, isRetransmissionAttempt shall be set to TRUE when invoking SSBD.","Yes",null,null,null,null,"Assigned",null,"Larry"]
[null,null,"VERSO, BILLY",null,633,"No","Qorvo","Technical",20,"8.2.7.3",6.5,"For non-interleaved MMS ranging, the MLME-RX-ENABLE.request needs to include the start time in ranging counter units and the clock offset information to enable the blind RX of the fragments that are invisible until ",null,"Update the MLME-RX-ENABLE.request primitive accordingly.","Yes",null,null,null,null,"Assigned","I will do / make proposed resolution submission for group to consider","Billy"]
[null,null,"Kivinen, Tero",null,54,"No","Wi-SUN Alliance","Editorial",21,"8.3.2.2",6,"This is first use of MMS outside tables, expand it here. ",null,"Expand MMS here.","No",null,null,null,null,"Assigned",null,"Editor"]
[null,null,"Kivinen, Tero",null,55,"No","Wi-SUN Alliance","Editorial",21,"8.3.2.2",6,"This is first use of NBA, expand it here. ",null,"Expand NBA here.","No",null,null,null,null,"Assigned",null,"Editor"]
[null,null,"VERSO, BILLY",null,322,"No","Qorvo","Technical",21,"8.3.2.2",6,"I think the TxTimeSpecified parameter should also be RCTU_TIME in the UWB driven case.  If we delete the \"NBA\" from the sentence the \"MMS UWB\" can cover both  cases..",null,"Delete the \"NBA\" from the sentence.","Yes",null,null,null,null,"Assigned",null,"Billy"]
[null,null,"Kivinen, Tero",null,56,"No","Wi-SUN Alliance","Technical",21,"8.3.2.3",9,"Listing Rx/Tx Start/End markers for all eight Rifs is quite repetitive. ",null,"Change them to be array of unsigned integers. This is conceptual interface, so having Type of \"Array of eight Unsigned Integers\" is fine (similar than what is used for RangingStsFom).","No",null,null,null,null,"Suggested Assignment","Billy"]
[null,null,"MAMAN, MICKAEL",null,146,"Yes","STMicroelectronics","Editorial",21,"8.3.2.3",9,"typo : received instead of reveived",null,"change 16 time for RxRif1-8MarkerStart and RxRif1-8MarkerEnd","Yes",null,null,null,null,"Assigned",null,"Editor"]
[null,null,"MAMAN, MICKAEL",null,147,"Yes","STMicroelectronics","Technical",21,"8.3.2.3",9,"simplify the table of RangingReportDescriptor with 4 tables of size 8",null,"merge  RxRif1-8MarkerStart into  RxRifMarkerStart[8], RxRif1-8MarkerEnd into RxRifMarkerEnd[8], TxRif1-8MarkerStart into  TxRifMarkerStart[8], TxRif1-8MarkerEnd into TxRifMarkerEnd[8]","Yes"]
[null,null,"PAKROOH, POORIA",null,227,"No","Qualcomm","Technical",21,"8.3.2.3",9,"What is the reference for the RifMarker startand end time?",null,"In Table 8-28, specify the reference for the RifMarker startand end time","Yes",null,null,null,null,"Suggested Assignment","Xiliang"]
[null,null,"ZAKAIB, LARRY",null,661,"Yes","Spark Microsystems","Editorial",21,"8.3.2.3",9,"Correct the typo \"reveived\" with \"received\" in all occuraances in Table 8-28",null,"Change \"reveived\" to \"received\" everywhere in  Table 8-28","Yes",null,null,null,null,"Assigned",null,"Editor"]
[null,null,"MAMAN, MICKAEL",null,148,"Yes","STMicroelectronics","Technical",24,"8.3.3",4,"In DataRate element of the TXOptions, the range is between 0-7 in IEEE802.15.4 whereas for OQPSK PHYs the range is between 1-8 In table 67",null,"change the valid range of DataRate element to 0-8","Yes",null,null,null,null,"Assigned",null,"Alex"]
[null,null,"PAKROOH, POORIA",null,228,"No","Qualcomm","Technical",25,"8.3.3",1,"Why is \"SensREceive\" needed? It is not used anywhere else in the draft. Monostatic involves single device. We are not defining any other parameters for monostatic",null,"Remove \"SensReceive\" from Table 8-29.","Yes"]
[null,null,"KREBS, ALEX",null,107,"Yes","Apple","Editorial",25,"MCPS-DATA.request","10-25","HeaderIeList and other paramters are ambigious in the font chosen between I as in Information and l as in lowercase.",null,"Change font for this and possibly more primitives (including p.39 l.17, p.40 l.15)  such that I and l are rendered differently","No",null,null,null,null,"Assigned",null,"Editor"]
[null,null,"Kivinen, Tero",null,57,"No","Wi-SUN Alliance","Editorial",26,"8.3.4",11,"This is first use of IRK, expand it here. ",null,"Expand IRK here.","No","Accepted",null,null,null,"DONE"]
{"$rows_left_out":625}
{"sheet":"Progress-Status","index":1,"n_rows":497,"n_cols":28,"rows_kept":497,"cut":false,"hidden":false,"merged":[[26,1,26,24],[34,1,34,24],[1,1,1,8],[1,10,1,18],[6,4,6,6],[10,10,10,16],[18,1,18,24]]}
[]
[null,"Comments and Resolution Status",null,null,null,null,null,null,null,null,"Draft editing Status"]
[]
[null,"Total #  Comments","# with Blank resolution","# with non-blank resolution","# with \"Rejected\" resolution","# with \"Accepted\" resolution","# with \"Revised\" resolution","# Assigned","No Resolution, not Assigned",null,"DONE","N/A",null,"PART","Ready","ISSUE","ASSIGNED",null,"Blanks"]
[null,{"$f":"COUNTA(Comments!E:E)-1","v":663},{"$f":"B5-D5","v":548},{"$f":"COUNTA(Comments!P:P)-1","v":115},{"$f":"COUNTIF(Comments!P:P,\"Rejected\")","v":5},{"$f":"COUNTIF(Comments!P:P,\"Accepted\")","v":98},{"$f":"COUNTIF(Comments!P:P,\"Revised\")","v":12},{"$f":"COUNTA(Comments!V:V)-1","v":448},{"$f":"B5-D5-H5","v":100},null,{"$f":"COUNTIF(Comments!T:T,K4)","v":85},{"$f":"COUNTIF(Comments!T:T,L4)","v":5},null,{"$f":"COUNTIF(Comments!T:T,N4)","v":0},{"$f":"COUNTIF(Comments!T:T,O4)","v":25},{"$f":"COUNTIF(Comments!T:T,P4)","v":0},{"$f":"COUNTIF(Comments!T:T,Q4)","v":448},null,{"$f":"B5-(COUNTA(Comments!T:T)-1)","v":66}]
[]
[null,"Technical","Editorial",{"$f":"IF(D5=E7,\"Okay\",\"MIS-MATCHED\")","v":"Okay"},{"$f":"E5+F5+G5","v":115},null,null,null,null,null,{"$f":"SUM(K5:L5)","v":90},"Done + N/A"]
[null,{"$f":"COUNTIF(Comments!H:H,B7)","v":449},{"$f":"COUNTIF(Comments!H:H,C7)","v":208}]
[null,"General",{"$f":"IF(B5=C10,\"Okay\",\"MIS-MATCHED\")","v":"Okay"},{"$f":"D5/$B5","v":0.17345399698340874},7.5414781297134239E-3,0.14781297134238311,1.8099547511312219E-2,0.67571644042232282,0.15082956259426847,null,{"$f":"K7/$B$5","v":0.13574660633484162},"of total",null,{"$f":"N5/$B$5","v":0},{"$f":"O5/$B$5","v":3.7707390648567117E-2},{"$f":"P5/$B$5","v":0},{"$f":"Q5/$B$5","v":0.67571644042232282},null,{"$f":"S5/$B$5","v":9.9547511312217188E-2}]
[null,{"$f":"COUNTIF(Comments!H:H,B9)","v":6},{"$f":"C8+B8+B10","v":663}]
[null,null,null,null,null,null,null,null,null,null,{"$f":"K9+SUM(N9:Q9)","v":0.8491704374057315}]
[]
[]
[]
[]
[null,null,null,null,null,null,null,null,null,null,null," "]
[]
[]
[null,"Assigned Comments"]
[]
[null,"Alex","Aniruddh","Ben","Billy","Bin Q","Carl","Carlos","Editor","Frank","Hongwon","Huan-Bang",null,"Jinjing","Kangjin","Larry","Li-Hsiang",null,"Mickael","Pooria","Riku","Rojan","Tero","Wenzheng","Xiliang",null,"Youngwan","SUM"]
[null,{"$f":"COUNTIF(Comments!V:V,B21)","v":59},{"$f":"COUNTIF(Comments!V:V,C21)","v":0},{"$f":"COUNTIF(Comments!V:V,D21)","v":3},{"$f":"COUNTIF(Comments!V:V,E21)","v":61},{"$f":"COUNTIF(Comments!V:V,F21)","v":0},{"$f":"COUNTIF(Comments!V:V,G21)","v":0},{"$f":"COUNTIF(Comments!V:V,H21)","v":0},{"$f":"COUNTIF(Comments!V:V,I21)","v":126},{"$f":"COUNTIF(Comments!V:V,J21)","v":0},{"$f":"COUNTIF(Comments!V:V,K21)","v":10},{"$f":"COUNTIF(Comments!V:V,L21)","v":6},null,{"$f":"COUNTIF(Comments!V:V,N21)","v":0},{"$f":"COUNTIF(Comments!V:V,O21)","v":0},{"$f":"COUNTIF(Comments!V:V,P21)","v":12},{"$f":"COUNTIF(Comments!V:V,Q21)","v":0},null,{"$f":"COUNTIF(Comments!V:V,S21)","v":9},{"$f":"COUNTIF(Comments!V:V,T21)","v":40},{"$f":"COUNTIF(Comments!V:V,U21)","v":21},{"$f":"COUNTIF(Comments!V:V,V21)","v":52},{"$f":"COUNTIF(Comments!V:V,W21)","v":0},{"$f":"COUNTIF(Comments!V:V,X21)","v":0},{"$f":"COUNTIF(Comments!V:V,Y21)","v":21},null,{"$f":"COUNTIF(Comments!V:V,AA21)","v":23},{"$f":"SUM(B22:AA22)","v":443}]
[]
[]
[]
[]
[null,"Comments with Proposed Resolutions"]
[]
[null,"Alex","Aniruddh","Ben","Billy","Bin Q","Carl","Carlos","Editor","Frank","Hongwon","Jinjing",null,"Kangjin","Larry","Li-Hsiang","Mickael",null,"Pooria","Riku","Rojan","Tero","Wenzheng","Xiliang","Youngwan",null,"SUM"]
[null,null,null,null,null,null,null,null,null,null,null,null,null,null,null,null,null,null,null,null,null,null,null,null,null,null,{"$f":"SUM(B30:Y30)","v":0}]
[]
[]
[]
[]
[null,"Comments without Proposed Resolutions"]
[]
[null,"Alex","Aniruddh","Ben","Billy","Bin Q","Carl","Carlos","Editor","Frank","Hongwon","Jinjing",null,"Kangjin","Larry","Li-Hsiang","Mickael",null,"Pooria","Riku","Rojan","Tero","Wenzheng","Xiliang","Youngwan",null,"SUM"]
[null,null,null,null,null,null,null,null,null,null,null,null,null,null,null,null,null,null,null,null,null,null,null,null,null,null,{"$f":"SUM(B38:Y38)","v":0}]
[]
[]
{"$rows_left_out":458}
{"sheet":"Categories","index":2,"n_rows":497,"n_cols":23,"rows_kept":497,"cut":false,"hidden":false,"merged":[]}
["MMS w/NBA","MMS wo/NBA","New frame format","Ack changes","RSS","SSBD","Other channel access","Security","Multi-node ranging / Hyper Block","Narrow Band function","Device discovery Ranging","Device discovery Data","Parameter Negotiation","Wake-up Radio","UWB data offload","Narrow Band PHY","UWB PHY HRP","UWB PHY LE","Sensing","Dynamic Data Rate Mode","PICS","IEs","OTHER"]
["NBMSS","UWBMSS","NEWFR","ACK","RSS","SSBD","CHA","SEC","HB","NBF","DISC-R","DISC-D","PARNEG","WUR","UWBDO","PHYNB","PHYHRP","PHYLE","SENS","DDRN","PICS",null,"OTHER"]
["Alex","Carl","Alex","Billy","Sven","Larry","Ben","Rojan","Youngwan","Alex","Alex","[Carlos]","Billy","Billy","Youngwan","Bin Q","Vinod","Larry","Pooria & Bin Q","[Carlos]"]
[]
[]
[]
[null,null,null,null,null,"11.2.8"]
[null,null,null,null,null,"12.3.2"]
[]
[]
[]
[]
[]
[]
[]
[]
[]
[]
[]
[]
[]
[]
[]
[]
[]
[]
[]
[]
[]
[]
[]
[]
[]
[]
[]
[]
[]
[]
[]
[]
{"$rows_left_out":458}
{"sheet":"Detailed Status","index":3,"n_rows":4,"n_cols":21,"rows_kept":4,"cut":false,"hidden":false,"merged":[[2,10,2,19],[3,10,3,19],[0,1,0,3],[0,4,0,5],[0,6,0,8],[0,9,0,20],[1,1,1,3],[1,4,1,5],[1,6,1,8],[1,9,1,20]]}
["Resolution","Accepted",null,null,"Rejected",null,"Revised",null,null,"Blank"]
[null,{"$f":"COUNTIF(Comments!P:P,\"Accepted\")","v":98},null,null,{"$f":"COUNTIF(Comments!P:P,\"Rejected\")","v":5},null,{"$f":"COUNTIF(Comments!P:P,\"Revised\")","v":12},null,null,0]
["Editor Status","ISSUE","Ready","DONE","Waiting","N/A","ISSUE","Ready","DONE","Ready","Assigned",null,null,null,null,null,null,null,null,null,"Unassigned"]
[null,0,0,0,0,0,0,0,0,0,0,null,null,null,null,null,null,null,null,null,0]

{"sheet":"To-Do","index":4,"n_rows":0,"n_cols":0,"rows_kept":0,"cut":false,"hidden":false,"merged":[]}

{"sheet":"Historical Status","index":5,"n_rows":40,"n_cols":8,"rows_kept":40,"cut":false,"hidden":false,"merged":[[36,1,37,1],[18,0,38,0],[18,1,19,1],[20,1,21,1],[22,1,23,1],[24,1,25,1],[26,1,27,1],[28,1,29,1],[30,1,31,1],[32,1,33,1],[34,1,35,1],[4,0,17,0],[4,1,5,1],[6,1,7,1],[8,1,9,1],[10,1,11,1],[12,1,13,1],[14,1,15,1],[16,1,17,1]]}
["Version",null,"-00","-01","-02","-03","-04","-05"]
["Date",null,"2025-03-31",null,null,null,null,"2025-04-10"]
["Occasion",null,"Initial spreadsheet",null,null,null,null,"After 2025-04-10 telecon"]
[]
["Editorial","Total",216,null,null,null,null,208]
[null,null,{"$f":"C5/(C5+C19)","v":0.32579185520361992},null,null,null,null,{"$f":"H5/(H5+H19)","v":0.31372549019607843}]
[null,"Addressed",0,null,null,null,null,82]
[null,null,{"$f":"C7/C5","v":0},null,null,null,null,{"$f":"H7/H5","v":0.39423076923076922}]
[null,"Ready",0,null,null,null,null,0]
[null,null,{"$f":"C9/C5","v":0},null,null,null,null,{"$f":"H9/H5","v":0}]
[null,"Done",0,null,null,null,null,80]
[null,null,{"$f":"C11/C5","v":0},null,null,null,null,{"$f":"H11/H5","v":0.38461538461538464}]
[null,"N/A",0,null,null,null,null,2]
[null,null,{"$f":"C13/C5","v":0},null,null,null,null,{"$f":"H13/H5","v":9.6153846153846159E-3}]
[null,"ISSUE",0,null,null,null,null,0]
[null,null,{"$f":"C15/C5","v":0},null,null,null,null,{"$f":"H15/H5","v":0}]
[null,"To Be Addressed",216,null,null,null,null,126]
[null,null,{"$f":"C17/C5","v":1},null,null,null,null,{"$f":"H17/H5","v":0.60576923076923073}]
["Technical/General","Total",447,null,null,null,null,455]
[null,null,{"$f":"C19/(C19+C5)","v":0.67420814479638014},null,null,null,null,{"$f":"H19/(H19+H5)","v":0.68627450980392157}]
[null,"Addressed",0,null,null,null,null,33]
[null,null,{"$f":"C21/C19","v":0},null,null,null,null,{"$f":"H21/H19","v":7.2527472527472533E-2}]
[null,"Ready",0,null,null,null,null,25]
[null,null,{"$f":"C23/C19","v":0},null,null,null,null,{"$f":"H23/H19","v":5.4945054945054944E-2}]
[null,"Done",0,null,null,null,null,5]
[null,null,{"$f":"C25/C19","v":0},null,null,null,null,{"$f":"H25/H19","v":1.098901098901099E-2}]
[null,"N/A",0,null,null,null,null,3]
[null,null,{"$f":"C27/C19","v":0},null,null,null,null,{"$f":"H27/H19","v":6.5934065934065934E-3}]
[null,"To Be Addressed",447,null,null,null,null,422]
[null,null,{"$f":"C29/C19","v":1},null,null,null,null,{"$f":"H29/H19","v":0.92747252747252751}]
[null,"Assigned",0,null,null,null,null,322]
[null,null,{"$f":"C31/C19","v":0},null,null,null,null,{"$f":"H31/H19","v":0.70769230769230773}]
[null,"Proposed Resolutions",0,null,null,null,null,7]
[null,null,{"$f":"C33/C19","v":0},null,null,null,null,{"$f":"H33/H19","v":1.5384615384615385E-2}]
[null,"Need Proposals",0,null,null,null,null,315]
[null,null,{"$f":"C35/C19","v":0},null,null,null,null,{"$f":"H35/H19","v":0.69230769230769229}]
[null,"Not Assigned",447,null,null,null,null,100]
[null,null,{"$f":"C37/C19","v":1},null,null,null,null,{"$f":"H37/H19","v":0.21978021978021978}]
[null,"Issue",0,null,null,null,null,0]
["Blank","Total"]
{"$rows_left_out":1}
{"sheet":"CAD","index":6,"n_rows":1,"n_cols":22,"rows_kept":1,"cut":false,"hidden":false,"merged":[]}
["Comment ID","Comment #","Name","Style","Index #","Vote","Affiliation","Category","Page","Sub-clause","Line #","Comment","File","Proposed Change","Must Be Satisfied?","Disposition Status (Accepted, Rejected, Revised)","Disposition Detail","Category","Notes","Editor Status DONE, Ready, N/A)","Editor Notes","Assignee"]

{"sheet":"Sheet1","index":7,"n_rows":25,"n_cols":3,"rows_kept":25,"cut":false,"hidden":false,"merged":[]}
["Commenter","# Comments"]
["Billy Verso",345,{"$f":"B2/663","v":0.52036199095022628}]
["Mickael Maman",80,0.12066365007541478]
["Tero Kivinen",65,9.8039215686274508E-2]
["Pooria Pakrooh",27,4.072398190045249E-2]
["Rojan Chitrakar",24,3.6199095022624438E-2]
["Huan-Bang Li",21,3.1674208144796379E-2]
["Carlos Aldana",15,2.2624434389140271E-2]
["B. Rolfe",13,1.9607843137254902E-2]
["Li Panpan",12,1.8099547511312219E-2]
["Li-Hsiang Sun",10,1.5082956259426848E-2]
["Bin Tian",10,1.5082956259426848E-2]
["Alex Krebs",9,1.3574660633484163E-2]
["Bin Qian",7,1.0558069381598794E-2]
["Riku Pirhonen",5,7.5414781297134239E-3]
["Larry Zakaib",5,7.5414781297134239E-3]
["Jaegook Lee",3,4.5248868778280547E-3]
["Stephen Shellhammer",2,3.0165912518853697E-3]
["Vinod Kristem",2,3.0165912518853697E-3]
["Dries Neirynck",2,3.0165912518853697E-3]
["Menzo Wentink",2,3.0165912518853697E-3]
["Frank Leong",1,1.5082956259426848E-3]
["Hong Won Lee",1,1.5082956259426848E-3]
["Xiliang Luo",1,1.5082956259426848E-3]
["Stephan Sand",1,1.5082956259426848E-3]